{"text_format":"1","workbook":"xlsx","n_sheets":8,"sheets":["Main","Teams Logos","Teams A PIX","Teams B PIX","Referees","Stats","Scores","MVP"],"not_rendered":{"charts":0,"images":8,"macros":1,"external_links":0,"defined_names":1,"comments":0,"pivot_tables":0},"unopened":[],"bounds":{"document_bytes":16777216,"sheet_cells":100000,"rows_first":2000,"rows_last":500,"rows_between":2000,"halvings":0,"cell_chars":16384,"cell_head_chars":4096},"cells_cut":0,"cells_raw":0,"read":"whole","date_system":"1900"}

{"sheet":"Main","index":0,"n_rows":15,"n_cols":6,"rows_kept":15,"cut":false,"hidden":false,"merged":[[1,5,2,5]]}
["Teams Long","Teams Short","Coaches","Location"]
[{"$f":"'Teams Logos'!A2","v":"Al Ula"},{"$f":"_xlfn.IFS(A2='Teams Logos'!A3,Main!B6,A2='Teams Logos'!A4,Main!B7,A2='Teams Logos'!A5,Main!B8,A2='Teams Logos'!A6,Main!B9,A2='Teams Logos'!A7,Main!B10,A2='Teams Logos'!A8,Main!B11,A2='Teams Logos'!A9,Main!B12,A2='Teams Logos'!A10,Main!B13,A2='Teams Logos'!A11,Main!B14,A2='Teams Logos'!A12,Main!B15)","v":"ULA"},{"$f":"'Teams A PIX'!J2","v":"EFSTRATIOS KOUKOULEKIDIS"},"ملعب نادي النصر - الرياض"]
[{"$f":"'Teams Logos'!B2","v":"Al Ahli"},{"$f":"_xlfn.IFS(A3='Teams Logos'!A3,Main!B6,A3='Teams Logos'!A4,Main!B7,A3='Teams Logos'!A5,Main!B8,A3='Teams Logos'!A6,Main!B9,A3='Teams Logos'!A7,Main!B10,A3='Teams Logos'!A8,Main!B11,A3='Teams Logos'!A9,Main!B12,A3='Teams Logos'!A10,Main!B13,A3='Teams Logos'!A11,Main!B14,A3='Teams Logos'!A12,Main!B15)","v":"AHL"},{"$f":"'Teams B PIX'!J2","v":"ALI ALSANHANI"}]
[null,null,null,null,null,"Q1"]
[null,null,null,null,null,"Q2"]
[null,"AHL",null,null,null,"Q3"]
[null,"ITT",null,null,null,"Q4"]
[null,"FAT",null,null,null,"OT"]
[null,"KHA",null,null,null,"OT2"]
[null,"KHW"]
[null,"NAS"]
[null,"ULA"]
[null,"MUD"]
[null,"OHD"]
[null,"SAL"]

{"sheet":"Teams Logos","index":1,"n_rows":15,"n_cols":5,"rows_kept":15,"cut":false,"hidden":false,"merged":[]}
["SBL Team A","SBL Team B"]
["Al Ula","Al Ahli"]
["Al Ahli","Al Ahli"]
["Al Ittihad","Al Ittihad"]
["Al Fateh","Al Fateh"]
["Al Khaleej","Al Khaleej"]
["Al Khawaldiyah","Al Khawaldiyah"]
["Al Nassr","Al Nassr"]
["Al Ula","Al Ula"]
["Mudhar","Mudhar"]
["Ohod","Ohod"]
["Al Salam","Al Salam","Folder Path Team",null,"D:\\SBL 2024\\Teams\\TeamsLOGO\\"]
[]
[null,null,"Team A",{"$f":"(CONCATENATE(E12,A2,\".png\"))","v":"D:\\SBL 2024\\Teams\\TeamsLOGO\\Al Ula.png"}]
[null,null,"Team B",{"$f":"(CONCATENATE(E12,B2,\".png\"))","v":"D:\\SBL 2024\\Teams\\TeamsLOGO\\Al Ahli.png"}]

{"sheet":"Teams A PIX","index":2,"n_rows":30,"n_cols":11,"rows_kept":30,"cut":false,"hidden":false,"merged":[]}
["Team A","Player 1","Player 2","Player 3","Player 4","Player 5","T-Shirt","BENCH","BN","Coach","Team"]
["KHALID SALEH",{"$f":"_xlfn.IFS(B3=G2,A2,B3=G3,A3,B3=G4,A4,B3=G5,A5,B3=G6,A6,B3=G7,A7,B3=G8,A8,B3=G9,A9,B3=G10,A10,B3=G11,A11,B3=G12,A12,B3=G13,A13,B3=G14,A14,B3=G15,A15,B3=G16,A16,B3=G17,A17,B3=G18,A18,B3=G19,A19,B3=G20,A20,B3=G21,A21,B3=G22,A22,B3=G23,A23,B3=G24,A24)","v":"THON MAKER"},{"$f":"_xlfn.IFS(C3=G2,A2,C3=G3,A3,C3=G4,A4,C3=G5,A5,C3=G6,A6,C3=G7,A7,C3=G8,A8,C3=G9,A9,C3=G10,A10,C3=G11,A11,C3=G12,A12,C3=G13,A13,C3=G14,A14,C3=G15,A15,C3=G16,A16,C3=G17,A17,C3=G18,A18,C3=G19,A19,C3=G20,A20,C3=G21,A21,C3=G22,A22,C3=G23,A23,C3=G24,A24)","v":"JONATHAN GIBSON"},{"$f":"_xlfn.IFS(D3=G2,A2,D3=G3,A3,D3=G4,A4,D3=G5,A5,D3=G6,A6,D3=G7,A7,D3=G8,A8,D3=G9,A9,D3=G10,A10,D3=G11,A11,D3=G12,A12,D3=G13,A13,D3=G14,A14,D3=G15,A15,D3=G16,A16,D3=G17,A17,D3=G18,A18,D3=G19,A19,D3=G20,A20,D3=G21,A21,D3=G22,A22,D3=G23,A23,D3=G24,A24)","v":"WAEL ARAKJI"},{"$f":"_xlfn.IFS(E3=G2,A2,E3=G3,A3,E3=G4,A4,E3=G5,A5,E3=G6,A6,E3=G7,A7,E3=G8,A8,E3=G9,A9,E3=G10,A10,E3=G11,A11,E3=G12,A12,E3=G13,A13,E3=G14,A14,E3=G15,A15,E3=G16,A16,E3=G17,A17,E3=G18,A18,E3=G19,A19,E3=G20,A20,E3=G21,A21,E3=G22,A22,E3=G23,A23,E3=G24,A24)","v":"MOHAMMED SALEH"},{"$f":"_xlfn.IFS(F3=G2,A2,F3=G3,A3,F3=G4,A4,F3=G5,A5,F3=G6,A6,F3=G7,A7,F3=G8,A8,F3=G9,A9,F3=G10,A10,F3=G11,A11,F3=G12,A12,F3=G13,A13,F3=G14,A14,F3=G15,A15,F3=G16,A16,F3=G17,A17,F3=G18,A18,F3=G19,A19,F3=G20,A20,F3=G21,A21,F3=G22,A22,F3=G23,A23,F3=G24,A24)","v":"MOHAMMED ALSUWAILEM"},"00",{"$f":"_xlfn.IFS(I2=G2,A2,I2=G3,A3,I2=G4,A4,I2=G5,A5,I2=G6,A6,I2=G7,A7,I2=G8,A8,I2=G9,A9,I2=G10,A10,I2=G11,A11,I2=G12,A12,I2=G13,A13,I2=G14,A14,I2=G15,A15,I2=G16,A16,I2=G17,A17,I2=G18,A18,I2=G19,A19,I2=G20,A20,I2=G21,A21,I2=G22,A22,I2=G23,A23,I2=G24,A24)","v":"KHALID SALEH"},"00","EFSTRATIOS KOUKOULEKIDIS",{"$f":"'Teams Logos'!A2","v":"Al Ula"}]
["MOHAMMED ADAM ALHWSAWi","2","22","16","9","12","0",{"$f":"_xlfn.IFS(I3=G3,A3,I3=G4,A4,I3=G5,A5,I3=G6,A6,I3=G7,A7,I3=G8,A8,I3=G9,A9,I3=G10,A10,I3=G11,A11,I3=G12,A12,I3=G13,A13,I3=G14,A14,I3=G15,A15,I3=G16,A16,I3=G17,A17,I3=G18,A18,I3=G19,A19,I3=G20,A20,I3=G21,A21,I3=G22,A22,I3=G23,A23,I3=G24,A24,I3=G25,A25)","v":"MOHAMMED ADAM ALHWSAWi"},"0"]
["SAJAD AL-AQiLi",null,null,null,null,null,"1","SAJAD AL-AQiLi","1"]
["ALI AL AMRAD",null,null,null,null,null,"3","`JAMIL AL-AWADHI","5"]
["`JAMIL AL-AWADHI",null,null,null,null,null,"5","JONATHAN GIBSON","22"]
["MOHAMMED ALSAQER",null,null,null,null,null,"7","MOHAMMED ALSAQER","7"]
["ABDULAZIZ ALALAWI",null,null,null,null,null,"8","ABDULAZIZ ALALAWI","8"]
["MOHAMMED SALEH",null,null,null,null,null,"9"]
["HAMMAM HUSSAIN",null,null,null,null,null,"10"]
["MOHAMMED ALSUWAILEM",null,null,null,null,null,"12"]
["AHMED ALMUKHTAR",null,null,null,null,null,"13"]
["AHMAD ALJEZANI",null,null,null,null,null,"35"]
["THON MAKER",null,null,null,null,null,"2"]
["JONATHAN GIBSON",null,null,null,null,null,"22"]
["WAEL ARAKJI",null,null,null,null,null,"16"]
[]
[]
[]
[]
[]
[]
[]
[]
["Folder Path Players",{"$f":"(CONCATENATE(E25,K2,\"\\PIX\\\"))","v":"D:\\SBL 2024\\Teams\\Al Ula\\PIX\\"},null,null,"D:\\SBL 2024\\Teams\\"]
["Player 1",{"$f":"(CONCATENATE(B25,B2,\".png\"))","v":"D:\\SBL 2024\\Teams\\Al Ula\\PIX\\THON MAKER.png"}]
["Player 2",{"$f":"(CONCATENATE(B25,C2,\".png\"))","v":"D:\\SBL 2024\\Teams\\Al Ula\\PIX\\JONATHAN GIBSON.png"}]
["Player 3",{"$f":"(CONCATENATE(B25,D2,\".png\"))","v":"D:\\SBL 2024\\Teams\\Al Ula\\PIX\\WAEL ARAKJI.png"}]
["Player 4",{"$f":"(CONCATENATE(B25,E2,\".png\"))","v":"D:\\SBL 2024\\Teams\\Al Ula\\PIX\\MOHAMMED SALEH.png"}]
["Player 5",{"$f":"(CONCATENATE(B25,F2,\".png\"))","v":"D:\\SBL 2024\\Teams\\Al Ula\\PIX\\MOHAMMED ALSUWAILEM.png"}]

{"sheet":"Teams B PIX","index":3,"n_rows":30,"n_cols":11,"rows_kept":30,"cut":false,"hidden":false,"merged":[]}
["Team B","Player 1","Player 2","Player 3","Player 4","Player 5","T-Shirt","BENCH","BN","Coach","Team"]
["Abbas Alhwsawi",{"$f":"_xlfn.IFS(B3=G2,A2,B3=G3,A3,B3=G4,A4,B3=G5,A5,B3=G6,A6,B3=G7,A7,B3=G8,A8,B3=G9,A9,B3=G10,A10,B3=G11,A11,B3=G12,A12,B3=G13,A13,B3=G14,A14,B3=G15,A15,B3=G16,A16,B3=G17,A17,B3=G18,A18,B3=G19,A19,B3=G20,A20,B3=G21,A21,B3=G22,A22,B3=G23,A23,B3=G24,A24)","v":"Abbas Alhwsawi"},{"$f":"_xlfn.IFS(C3=G2,A2,C3=G3,A3,C3=G4,A4,C3=G5,A5,C3=G6,A6,C3=G7,A7,C3=G8,A8,C3=G9,A9,C3=G10,A10,C3=G11,A11,C3=G12,A12,C3=G13,A13,C3=G14,A14,C3=G15,A15,C3=G16,A16,C3=G17,A17,C3=G18,A18,C3=G19,A19,C3=G20,A20,C3=G21,A21,C3=G22,A22,C3=G23,A23,C3=G24,A24)","v":"Khalid Abdel Gabar"},{"$f":"_xlfn.IFS(D3=G2,A2,D3=G3,A3,D3=G4,A4,D3=G5,A5,D3=G6,A6,D3=G7,A7,D3=G8,A8,D3=G9,A9,D3=G10,A10,D3=G11,A11,D3=G12,A12,D3=G13,A13,D3=G14,A14,D3=G15,A15,D3=G16,A16,D3=G17,A17,D3=G18,A18,D3=G19,A19,D3=G20,A20,D3=G21,A21,D3=G22,A22,D3=G23,A23,D3=G24,A24)","v":"Fahad Belal"},{"$f":"_xlfn.IFS(E3=G2,A2,E3=G3,A3,E3=G4,A4,E3=G5,A5,E3=G6,A6,E3=G7,A7,E3=G8,A8,E3=G9,A9,E3=G10,A10,E3=G11,A11,E3=G12,A12,E3=G13,A13,E3=G14,A14,E3=G15,A15,E3=G16,A16,E3=G17,A17,E3=G18,A18,E3=G19,A19,E3=G20,A20,E3=G21,A21,E3=G22,A22,E3=G23,A23,E3=G24,A24)","v":"THAMER FURAYJ"},{"$f":"_xlfn.IFS(F3=G2,A2,F3=G3,A3,F3=G4,A4,F3=G5,A5,F3=G6,A6,F3=G7,A7,F3=G8,A8,F3=G9,A9,F3=G10,A10,F3=G11,A11,F3=G12,A12,F3=G13,A13,F3=G14,A14,F3=G15,A15,F3=G16,A16,F3=G17,A17,F3=G18,A18,F3=G19,A19,F3=G20,A20,F3=G21,A21,F3=G22,A22,F3=G23,A23,F3=G24,A24)","v":"ALI SHUBAYLI"},"6",{"$f":"_xlfn.IFS(I2=G2,A2,I2=G3,A3,I2=G4,A4,I2=G5,A5,I2=G6,A6,I2=G7,A7,I2=G8,A8,I2=G9,A9,I2=G10,A10,I2=G11,A11,I2=G12,A12,I2=G13,A13,I2=G14,A14,I2=G15,A15,I2=G16,A16,I2=G17,A17,I2=G18,A18,I2=G19,A19,I2=G20,A20,I2=G21,A21,I2=G22,A22,I2=G23,A23,I2=G24,A24)","v":"MARZOUQ ALMUWALLAD"},"30","ALI ALSANHANI",{"$f":"'Teams Logos'!B2","v":"Al Ahli"}]
["Fahad Belal","6","21","7","8","10","7",{"$f":"_xlfn.IFS(I3=G2,A2,I3=G3,A3,I3=G4,A4,I3=G5,A5,I3=G6,A6,I3=G7,A7,I3=G8,A8,I3=G9,A9,I3=G10,A10,I3=G11,A11,I3=G12,A12,I3=G13,A13,I3=G14,A14,I3=G15,A15,I3=G16,A16,I3=G17,A17,I3=G18,A18,I3=G19,A19,I3=G20,A20,I3=G21,A21,I3=G22,A22,I3=G23,A23,I3=G24,A24)","v":"AYMAN ALMUWALLAD"},"14"]
["THAMER FURAYJ",null,null,null,null,null,"8",{"$f":"_xlfn.IFS(I4=G2,A2,I4=G3,A3,I4=G4,A4,I4=G5,A5,I4=G6,A6,I4=G7,A7,I4=G8,A8,I4=G9,A9,I4=G10,A10,I4=G11,A11,I4=G12,A12,I4=G13,A13,I4=G14,A14,I4=G15,A15,I4=G16,A16,I4=G17,A17,I4=G18,A18,I4=G19,A19,I4=G20,A20,I4=G21,A21,I4=G22,A22,I4=G23,A23,I4=G24,A24)","v":"ALI SHUBAYLI"},"10"]
["ALI SHUBAYLI",null,null,null,null,null,"10",{"$f":"_xlfn.IFS(I5=G2,A2,I5=G3,A3,I5=G4,A4,I5=G5,A5,I5=G6,A6,I5=G7,A7,I5=G8,A8,I5=G9,A9,I5=G10,A10,I5=G11,A11,I5=G12,A12,I5=G13,A13,I5=G14,A14,I5=G15,A15,I5=G16,A16,I5=G17,A17,I5=G18,A18,I5=G19,A19,I5=G20,A20,I5=G21,A21,I5=G22,A22,I5=G23,A23,I5=G24,A24)","v":"ABDULRAHMAN BIN MAHFUTH"},"20"]
["NAIF ALTHALABI",null,null,null,null,null,"12",{"$f":"_xlfn.IFS(I6=G2,A2,I6=G3,A3,I6=G4,A4,I6=G5,A5,I6=G6,A6,I6=G7,A7,I6=G8,A8,I6=G9,A9,I6=G10,A10,I6=G11,A11,I6=G12,A12,I6=G13,A13,I6=G14,A14,I6=G15,A15,I6=G16,A16,I6=G17,A17,I6=G18,A18,I6=G19,A19,I6=G20,A20,I6=G21,A21,I6=G22,A22,I6=G23,A23,I6=G24,A24)","v":"SAIF MAJRASHI"},"23"]
["AYMAN ALMUWALLAD",null,null,null,null,null,"14",{"$f":"_xlfn.IFS(I7=G2,A2,I7=G3,A3,I7=G4,A4,I7=G5,A5,I7=G6,A6,I7=G7,A7,I7=G8,A8,I7=G9,A9,I7=G10,A10,I7=G11,A11,I7=G12,A12,I7=G13,A13,I7=G14,A14,I7=G15,A15,I7=G16,A16,I7=G17,A17,I7=G18,A18,I7=G19,A19,I7=G20,A20,I7=G21,A21,I7=G22,A22,I7=G23,A23,I7=G24,A24)","v":"IBRAHIM KATTAN"},"33"]
["ABDULRAHMAN BIN MAHFUTH",null,null,null,null,null,"20",{"$f":"_xlfn.IFS(I8=G2,A2,I8=G3,A3,I8=G4,A4,I8=G5,A5,I8=G6,A6,I8=G7,A7,I8=G8,A8,I8=G9,A9,I8=G10,A10,I8=G11,A11,I8=G12,A12,I8=G13,A13,I8=G14,A14,I8=G15,A15,I8=G16,A16,I8=G17,A17,I8=G18,A18,I8=G19,A19,I8=G20,A20,I8=G21,A21,I8=G22,A22,I8=G23,A23,I8=G24,A24)","v":"NAIF ALTHALABI"},"12"]
["Khalid Abdel Gabar",null,null,null,null,null,"21"]
["SAIF MAJRASHI",null,null,null,null,null,"23"]
["MOHMMED KHAFAJI",null,null,null,null,null,"24"]
["MOAYAD ALSHARIF",null,null,null,null,null,"25"]
["MARZOUQ ALMUWALLAD",null,null,null,null,null,"30"]
["IBRAHIM KATTAN",null,null,null,null,null,"33"]
[" ALFONZO MC KINNIE",null,null,null,null,null,"28"]
["NICK   PERKINS",null,null,null,null,null,"33"]
[" JUSTIN   PATTON                   ",null,null,null,null,null,0]
[]
[]
[]
[]
[]
[]
[]
["Folder Path Players",{"$f":"(CONCATENATE(E25,K2,\"\\PIX\\\"))","v":"D:\\SBL 2024\\Teams\\Al Ahli\\PIX\\"},null,null,"D:\\SBL 2024\\Teams\\"]
["Player 1",{"$f":"(CONCATENATE(B25,B2,\".png\"))","v":"D:\\SBL 2024\\Teams\\Al Ahli\\PIX\\Abbas Alhwsawi.png"}]
["Player 2",{"$f":"(CONCATENATE(B25,C2,\".png\"))","v":"D:\\SBL 2024\\Teams\\Al Ahli\\PIX\\Khalid Abdel Gabar.png"}]
["Player 3",{"$f":"(CONCATENATE(B25,D2,\".png\"))","v":"D:\\SBL 2024\\Teams\\Al Ahli\\PIX\\Fahad Belal.png"}]
["Player 4",{"$f":"(CONCATENATE(B25,E2,\".png\"))","v":"D:\\SBL 2024\\Teams\\Al Ahli\\PIX\\THAMER FURAYJ.png"}]
["Player 5",{"$f":"(CONCATENATE(B25,F2,\".png\"))","v":"D:\\SBL 2024\\Teams\\Al Ahli\\PIX\\ALI SHUBAYLI.png"}]

{"sheet":"Referees","index":4,"n_rows":4,"n_cols":1,"rows_kept":4,"cut":false,"hidden":false,"merged":[]}
["Referees"]
["Rabah Najim"]
["Adel Ghulom"]
["Ayman Alhazmi"]

{"sheet":"Stats","index":5,"n_rows":21,"n_cols":10,"rows_kept":21,"cut":false,"hidden":false,"merged":[]}
["Team A","Column1","_1","Team B"]
["18/38 (47%)",null,"FG                Field Goals","17/37 (45%)"]
["13/20 (65%)","","2P\n                2 Points Made","11/23 (47%)"]
["5/18 (27%)","","3P\n                3 Point Field Goals","6/14 (42%)"]
["3/5 (60%) ","","FT\n                F.Throws","6/14 (42%)"]
["31","","REB\n                Total Rebounds"]
[9,"","AST\n                Assists",9]
["3","","STL\n                Steals","2"]
[1,"","BLK\n                Blocks",2]
[5,"","TO\n                Turnovers",4]
["12 (7)","","PF\n                Personal Fouls","7 (12)"]
["8","","PIP\n                Points in the paint","10"]
["10","","2CP\n                Second chance points","18"]
["6","","PFT\n                Points from turnovers","3"]
["46","","BP\n                Bench points","26"]
["16","","FBP\n                Fast break points","14"]
[]
[null,null,null,null,null,"23/59 (38%)",null,"FG ",null,"26/63 (41%)"]
[null,null,null,null,null,"17/41 (41%)",null,"2P ",null,"14/31 (45%)"]
[null,null,null,null,null,"6/18 (33%)",null,"3P ",null,"12/32 (37%)"]
[null,null,null,null,null,"23/30 (76%)",null,"FT ",null,"12/18 (66%)"]

{"sheet":"Scores","index":6,"n_rows":10,"n_cols":4,"rows_kept":10,"cut":false,"hidden":false,"merged":[[0,5,1,5],[2,2,3,2]]}
[null,"Team A","Quarter","Team B"]
["Teams","ULA","OT","AHL"]
["Scores",24,null,55]
["Fouls",3,null,2]
[]
[]
["Folder Path Fouls A","D:\\SBL 2024\\GFX\\PNG\\Fouls\\A\\"]
["Folder Path Fouls B","D:\\SBL 2024\\GFX\\PNG\\Fouls\\B\\"]
["Team A",{"$f":"(CONCATENATE(B7,B4,\".png\"))","v":"D:\\SBL 2024\\GFX\\PNG\\Fouls\\A\\3.png"}]
["Team B",{"$f":"(CONCATENATE(B8,D4,\".png\"))","v":"D:\\SBL 2024\\GFX\\PNG\\Fouls\\B\\2.png"}]

{"sheet":"MVP","index":7,"n_rows":57,"n_cols":7,"rows_kept":57,"cut":false,"hidden":false,"merged":[]}
["TEAM A","P#","ALL P#","PT","RB","AS","TL"]
[{"$f":"_xlfn.IFS(B2=C3,A3,B2=C3,A3,B2=C4,A4,B2=C5,A5,B2=C6,A6,B2=C7,A7,B2=C8,A8,B2=C9,A9,B2=C10,A10,B2=C11,A11,B2=C12,A12,B2=C13,A13,B2=C14,A14,B2=C15,A15,B2=C16,A16,B2=C17,A17,B2=C18,A18,B2=C19,A19,B2=C20,A20,B2=C21,A21,B2=C22,A22)","v":"WAEL ARAKJI"},"16",null,28,6,3,{"$f":"'Teams A PIX'!K2","v":"Al Ula"}]
[{"$f":"'Teams A PIX'!A2","v":"KHALID SALEH"},null,{"$f":"'Teams A PIX'!G2","v":"00"}]
[{"$f":"'Teams A PIX'!A3","v":"MOHAMMED ADAM ALHWSAWi"},null,{"$f":"'Teams A PIX'!G3","v":"0"}]
[{"$f":"'Teams A PIX'!A4","v":"SAJAD AL-AQiLi"},null,{"$f":"'Teams A PIX'!G4","v":"1"}]
[{"$f":"'Teams A PIX'!A5","v":"ALI AL AMRAD"},null,{"$f":"'Teams A PIX'!G5","v":"3"}]
[{"$f":"'Teams A PIX'!A6","v":"`JAMIL AL-AWADHI"},null,{"$f":"'Teams A PIX'!G6","v":"5"}]
[{"$f":"'Teams A PIX'!A7","v":"MOHAMMED ALSAQER"},null,{"$f":"'Teams A PIX'!G7","v":"7"}]
[{"$f":"'Teams A PIX'!A8","v":"ABDULAZIZ ALALAWI"},null,{"$f":"'Teams A PIX'!G8","v":"8"}]
[{"$f":"'Teams A PIX'!A9","v":"MOHAMMED SALEH"},null,{"$f":"'Teams A PIX'!G9","v":"9"}]
[{"$f":"'Teams A PIX'!A10","v":"HAMMAM HUSSAIN"},null,{"$f":"'Teams A PIX'!G10","v":"10"}]
[{"$f":"'Teams A PIX'!A11","v":"MOHAMMED ALSUWAILEM"},null,{"$f":"'Teams A PIX'!G11","v":"12"}]
[{"$f":"'Teams A PIX'!A12","v":"AHMED ALMUKHTAR"},null,{"$f":"'Teams A PIX'!G12","v":"13"}]
[{"$f":"'Teams A PIX'!A13","v":"AHMAD ALJEZANI"},null,{"$f":"'Teams A PIX'!G13","v":"35"}]
[{"$f":"'Teams A PIX'!A14","v":"THON MAKER"},null,{"$f":"'Teams A PIX'!G14","v":"2"}]
[{"$f":"'Teams A PIX'!A15","v":"JONATHAN GIBSON"},null,{"$f":"'Teams A PIX'!G15","v":"22"}]
[{"$f":"'Teams A PIX'!A16","v":"WAEL ARAKJI"},null,{"$f":"'Teams A PIX'!G16","v":"16"}]
[{"$f":"'Teams A PIX'!A17","v":0},null,{"$f":"'Teams A PIX'!G17","v":0}]
[{"$f":"'Teams A PIX'!A18","v":0},null,{"$f":"'Teams A PIX'!G18","v":0}]
[{"$f":"'Teams A PIX'!A19","v":0},null,{"$f":"'Teams A PIX'!G19","v":0}]
[{"$f":"'Teams A PIX'!A20","v":0},null,{"$f":"'Teams A PIX'!G20","v":0}]
[{"$f":"'Teams A PIX'!A21","v":0},null,{"$f":"'Teams A PIX'!G21","v":0}]
["-----","-----","-----"]
["-----","-----","-----"]
["TEAM B","P#","ALL P#","PT","RB","AS","TL"]
[{"$f":"_xlfn.IFS(B26=C27,A27,B26=C28,A28,B26=C29,A29,B26=C30,A30,B26=C31,A31,B26=C32,A32,B26=C33,A33,B26=C34,A34,B26=C35,A35,B26=C36,A36,B26=C37,A37,B26=C38,A38,B26=C39,A39,B26=C40,A40,B26=C41,A41,B26=C42,A42,B26=C43,A43,B26=C44,A44,B26=C45,A45,B26=C46,A46,B26=C47,A47,B26=C48,A48)","v":"Fahad Belal"},"7",4,21,7,6,{"$f":"'Teams B PIX'!K2","v":"Al Ahli"}]
[{"$f":"'Teams B PIX'!A2","v":"Abbas Alhwsawi"},null,{"$f":"'Teams B PIX'!G2","v":"6"}]
[{"$f":"'Teams B PIX'!A3","v":"Fahad Belal"},null,{"$f":"'Teams B PIX'!G3","v":"7"}]
[{"$f":"'Teams B PIX'!A4","v":"THAMER FURAYJ"},null,{"$f":"'Teams B PIX'!G4","v":"8"}]
[{"$f":"'Teams B PIX'!A5","v":"ALI SHUBAYLI"},null,{"$f":"'Teams B PIX'!G5","v":"10"}]
[{"$f":"'Teams B PIX'!A6","v":"NAIF ALTHALABI"},null,{"$f":"'Teams B PIX'!G6","v":"12"}]
[{"$f":"'Teams B PIX'!A7","v":"AYMAN ALMUWALLAD"},null,{"$f":"'Teams B PIX'!G7","v":"14"}]
[{"$f":"'Teams B PIX'!A8","v":"ABDULRAHMAN BIN MAHFUTH"},null,{"$f":"'Teams B PIX'!G8","v":"20"}]
[{"$f":"'Teams B PIX'!A9","v":"Khalid Abdel Gabar"},null,{"$f":"'Teams B PIX'!G9","v":"21"}]
[{"$f":"'Teams B PIX'!A10","v":"SAIF MAJRASHI"},null,{"$f":"'Teams B PIX'!G10","v":"23"}]
[{"$f":"'Teams B PIX'!A11","v":"MOHMMED KHAFAJI"},null,{"$f":"'Teams B PIX'!G11","v":"24"}]
[{"$f":"'Teams B PIX'!A12","v":"MOAYAD ALSHARIF"},null,{"$f":"'Teams B PIX'!G12","v":"25"}]
[{"$f":"'Teams B PIX'!A13","v":"MARZOUQ ALMUWALLAD"},null,{"$f":"'Teams B PIX'!G13","v":"30"}]
[{"$f":"'Teams B PIX'!A14","v":"IBRAHIM KATTAN"},null,{"$f":"'Teams B PIX'!G14","v":"33"}]
[{"$f":"'Teams B PIX'!A15","v":" ALFONZO MC KINNIE"},null,{"$f":"'Teams B PIX'!G15","v":"28"}]
[{"$f":"'Teams B PIX'!A16","v":"NICK   PERKINS"},null,{"$f":"'Teams B PIX'!G16","v":"33"}]
[{"$f":"'Teams B PIX'!A17","v":" JUSTIN   PATTON                   "},null,{"$f":"'Teams B PIX'!G17","v":0}]
[{"$f":"'Teams B PIX'!A18","v":0},null,{"$f":"'Teams B PIX'!G18","v":0}]
[{"$f":"'Teams B PIX'!A19","v":0},null,{"$f":"'Teams B PIX'!G19","v":0}]
[{"$f":"'Teams B PIX'!A20","v":0},null,{"$f":"'Teams B PIX'!G20","v":0}]
[{"$f":"'Teams B PIX'!A21","v":0},null,{"$f":"'Teams B PIX'!G21","v":0}]
[{"$f":"'Teams B PIX'!A22","v":0},null,{"$f":"'Teams B PIX'!G22","v":0}]
[{"$f":"'Teams B PIX'!A23","v":0},null,{"$f":"'Teams B PIX'!G23","v":0}]
[]
[]
["Folder Path Team A","D:\\SBL 2024\\Teams\\"]
["Folder Path Team",{"$f":"(CONCATENATE(B51,G2,\"\\PIX\\\"))","v":"D:\\SBL 2024\\Teams\\Al Ula\\PIX\\"}]
[null,{"$f":"(CONCATENATE(B52,A2,\".png\"))","v":"D:\\SBL 2024\\Teams\\Al Ula\\PIX\\WAEL ARAKJI.png"}]
[]
["Folder Path Team B","D:\\SBL 2024\\Teams\\"]
["Folder Path Team",{"$f":"(CONCATENATE(B55,G26,\"\\PIX\\\"))","v":"D:\\SBL 2024\\Teams\\Al Ahli\\PIX\\"}]
[null,{"$f":"(CONCATENATE(B56,A26,\".png\"))","v":"D:\\SBL 2024\\Teams\\Al Ahli\\PIX\\Fahad Belal.png"}]